Stuck at "What type of models are you looking to build"

I installed perceptilabs in a new conda env. When I start perceptilabs it opens the browser and displays the “What type of models are you looking to build” promt and i am not able to close it. All i can do is click the File, Edit, Help, and all the different workspaces but the actual workspace is blurred out behind the promt. Here is the traceback error I get in the terminal:

perceptilabs -v 3
2021-08-12 16:51:56.920590: I tensorflow/stream_executor/platform/default/dso_loader.cc:53] Successfully opened dynamic library cudart64_110.dll
2021-08-12 16:51:59.745351: I tensorflow/stream_executor/platform/default/dso_loader.cc:53] Successfully opened dynamic library nvcuda.dll
2021-08-12 16:51:59.762873: I tensorflow/core/common_runtime/gpu/gpu_device.cc:1733] Found device 0 with properties:
pciBusID: 0000:01:00.0 name: GeForce GTX 980 computeCapability: 5.2
coreClock: 1.291GHz coreCount: 16 deviceMemorySize: 4.00GiB deviceMemoryBandwidth: 208.91GiB/s
2021-08-12 16:51:59.762981: I tensorflow/stream_executor/platform/default/dso_loader.cc:53] Successfully opened dynamic library cudart64_110.dll
2021-08-12 16:51:59.771971: I tensorflow/stream_executor/platform/default/dso_loader.cc:53] Successfully opened dynamic library cublas64_11.dll
2021-08-12 16:51:59.772068: I tensorflow/stream_executor/platform/default/dso_loader.cc:53] Successfully opened dynamic library cublasLt64_11.dll
2021-08-12 16:51:59.779302: I tensorflow/stream_executor/platform/default/dso_loader.cc:53] Successfully opened dynamic library cufft64_10.dll
2021-08-12 16:51:59.780719: I tensorflow/stream_executor/platform/default/dso_loader.cc:53] Successfully opened dynamic library curand64_10.dll
2021-08-12 16:51:59.784364: I tensorflow/stream_executor/platform/default/dso_loader.cc:53] Successfully opened dynamic library cusolver64_11.dll
2021-08-12 16:51:59.788014: I tensorflow/stream_executor/platform/default/dso_loader.cc:53] Successfully opened dynamic library cusparse64_11.dll
2021-08-12 16:51:59.788721: I tensorflow/stream_executor/platform/default/dso_loader.cc:53] Successfully opened dynamic library cudnn64_8.dll
2021-08-12 16:51:59.788846: I tensorflow/core/common_runtime/gpu/gpu_device.cc:1871] Adding visible gpu devices: 0
Operations to perform:
  Apply all migrations: admin, api, auth, contenttypes, sessions
Running migrations:
  No migrations to apply.
PerceptiLabs: Starting
2021-08-12 16:52:02.172204: I tensorflow/stream_executor/platform/default/dso_loader.cc:53] Successfully opened dynamic library cudart64_110.dll
2021-08-12 16:52:02.172912: I tensorflow/stream_executor/platform/default/dso_loader.cc:53] Successfully opened dynamic library cudart64_110.dll
Performing system checks...

System check identified no issues (0 silenced).
August 12, 2021 - 16:52:02
Django version 3.2, using settings 'static_file_server.settings'
Starting development server at http://127.0.0.1:8080/
Quit the server with CTRL-BREAK.
Performing system checks...

System check identified no issues (0 silenced).
August 12, 2021 - 16:52:03
Django version 3.2, using settings 'rygg.settings'
Starting development server at http://127.0.0.1:8000/
Quit the server with CTRL-BREAK.
[12/Aug/2021 16:52:04] "GET /?token=K5iuSsfbU7gyfBX4Ak8E_tnEkK8W0Lb6dk8xxd1wiP0 HTTP/1.1" 200 493
[12/Aug/2021 16:52:04] "GET /is_enterprise HTTP/1.1" 200 28
[12/Aug/2021 16:52:04] "GET /rygg_url HTTP/1.1" 200 0
[12/Aug/2021 16:52:04] "GET /rendering_kernel_url HTTP/1.1" 200 0
[12/Aug/2021 16:52:05] "GET /kernel_url HTTP/1.1" 200 0
[12/Aug/2021 16:52:05] "GET /is_enterprise HTTP/1.1" 200 28
[12/Aug/2021 16:52:05] "GET /keycloak_url HTTP/1.1" 200 0
2021-08-12 16:52:05.275780: I tensorflow/stream_executor/platform/default/dso_loader.cc:53] Successfully opened dynamic library nvcuda.dll
2021-08-12 16:52:05.275858: I tensorflow/stream_executor/platform/default/dso_loader.cc:53] Successfully opened dynamic library nvcuda.dll
2021-08-12 16:52:05.296737: I tensorflow/core/common_runtime/gpu/gpu_device.cc:1733] Found device 0 with properties:
pciBusID: 0000:01:00.0 name: GeForce GTX 980 computeCapability: 5.2
coreClock: 1.291GHz coreCount: 16 deviceMemorySize: 4.00GiB deviceMemoryBandwidth: 208.91GiB/s
2021-08-12 16:52:05.296912: I tensorflow/stream_executor/platform/default/dso_loader.cc:53] Successfully opened dynamic library cudart64_110.dll
2021-08-12 16:52:05.299836: I tensorflow/core/common_runtime/gpu/gpu_device.cc:1733] Found device 0 with properties:
pciBusID: 0000:01:00.0 name: GeForce GTX 980 computeCapability: 5.2
coreClock: 1.291GHz coreCount: 16 deviceMemorySize: 4.00GiB deviceMemoryBandwidth: 208.91GiB/s
2021-08-12 16:52:05.300077: I tensorflow/stream_executor/platform/default/dso_loader.cc:53] Successfully opened dynamic library cudart64_110.dll
2021-08-12 16:52:05.304680: I tensorflow/stream_executor/platform/default/dso_loader.cc:53] Successfully opened dynamic library cublas64_11.dll
2021-08-12 16:52:05.307746: I tensorflow/stream_executor/platform/default/dso_loader.cc:53] Successfully opened dynamic library cublasLt64_11.dll
2021-08-12 16:52:05.309335: I tensorflow/stream_executor/platform/default/dso_loader.cc:53] Successfully opened dynamic library cublas64_11.dll
2021-08-12 16:52:05.309410: I tensorflow/stream_executor/platform/default/dso_loader.cc:53] Successfully opened dynamic library cublasLt64_11.dll
2021-08-12 16:52:05.313131: I tensorflow/stream_executor/platform/default/dso_loader.cc:53] Successfully opened dynamic library cufft64_10.dll
2021-08-12 16:52:05.314804: I tensorflow/stream_executor/platform/default/dso_loader.cc:53] Successfully opened dynamic library curand64_10.dll
2021-08-12 16:52:05.314882: I tensorflow/stream_executor/platform/default/dso_loader.cc:53] Successfully opened dynamic library cufft64_10.dll
2021-08-12 16:52:05.316898: I tensorflow/stream_executor/platform/default/dso_loader.cc:53] Successfully opened dynamic library cusolver64_11.dll
2021-08-12 16:52:05.317309: I tensorflow/stream_executor/platform/default/dso_loader.cc:53] Successfully opened dynamic library curand64_10.dll
2021-08-12 16:52:05.319389: I tensorflow/stream_executor/platform/default/dso_loader.cc:53] Successfully opened dynamic library cusolver64_11.dll
2021-08-12 16:52:05.319421: I tensorflow/stream_executor/platform/default/dso_loader.cc:53] Successfully opened dynamic library cusparse64_11.dll
2021-08-12 16:52:05.323503: I tensorflow/stream_executor/platform/default/dso_loader.cc:53] Successfully opened dynamic library cudnn64_8.dll
2021-08-12 16:52:05.323661: I tensorflow/core/common_runtime/gpu/gpu_device.cc:1871] Adding visible gpu devices: 0
2021-08-12 16:52:05.324706: I tensorflow/stream_executor/platform/default/dso_loader.cc:53] Successfully opened dynamic library cusparse64_11.dll
2021-08-12 16:52:05.325667: I tensorflow/stream_executor/platform/default/dso_loader.cc:53] Successfully opened dynamic library cudnn64_8.dll
2021-08-12 16:52:05.325795: I tensorflow/core/common_runtime/gpu/gpu_device.cc:1871] Adding visible gpu devices: 0
[12/Aug/2021 16:52:05] "GET /is_enterprise HTTP/1.1" 200 28
[12/Aug/2021 16:52:05] "GET /keycloak_url HTTP/1.1" 200 0
[12/Aug/2021 16:52:05] "GET /rygg_url HTTP/1.1" 200 0
[12/Aug/2021 16:52:05] "GET /static/img/questionnarie/background1.png HTTP/1.1" 404 1837
[12/Aug/2021 16:52:05] "OPTIONS /projects/?token=K5iuSsfbU7gyfBX4Ak8E_tnEkK8W0Lb6dk8xxd1wiP0 HTTP/1.1" 200 0
[12/Aug/2021 16:52:05] "OPTIONS /app/updates_available/?token=K5iuSsfbU7gyfBX4Ak8E_tnEkK8W0Lb6dk8xxd1wiP0 HTTP/1.1" 200 0
[12/Aug/2021 16:52:05] "OPTIONS /app/version?token=K5iuSsfbU7gyfBX4Ak8E_tnEkK8W0Lb6dk8xxd1wiP0 HTTP/1.1" 200 0
[12/Aug/2021 16:52:05] "OPTIONS /files?path=C:\Users\faste\Documents\Perceptilabs\Default/Model%201/model.json&token=K5iuSsfbU7gyfBX4Ak8E_tnEkK8W0Lb6dk8xxd1wiP0 HTTP/1.1" 200 0
[12/Aug/2021 16:52:05] "GET /app/version?token=K5iuSsfbU7gyfBX4Ak8E_tnEkK8W0Lb6dk8xxd1wiP0 HTTP/1.1" 301 0
[12/Aug/2021 16:52:05] "HEAD /files?path=C:\Users\faste\Documents\Perceptilabs\Default/Model%201/model.json&token=K5iuSsfbU7gyfBX4Ak8E_tnEkK8W0Lb6dk8xxd1wiP0 HTTP/1.1" 200 83
[12/Aug/2021 16:52:05] "GET /projects/?token=K5iuSsfbU7gyfBX4Ak8E_tnEkK8W0Lb6dk8xxd1wiP0 HTTP/1.1" 200 270
[12/Aug/2021 16:52:05] "OPTIONS /app/version/?token=K5iuSsfbU7gyfBX4Ak8E_tnEkK8W0Lb6dk8xxd1wiP0 HTTP/1.1" 200 0
[12/Aug/2021 16:52:05] "GET /app/version/?token=K5iuSsfbU7gyfBX4Ak8E_tnEkK8W0Lb6dk8xxd1wiP0 HTTP/1.1" 200 22
[12/Aug/2021 16:52:05] "OPTIONS /files?path=C:\Users\faste\Documents\Perceptilabs\Default/Model%203/model.json&token=K5iuSsfbU7gyfBX4Ak8E_tnEkK8W0Lb6dk8xxd1wiP0 HTTP/1.1" 200 0
[12/Aug/2021 16:52:05] "HEAD /files?path=C:\Users\faste\Documents\Perceptilabs\Default/Model%203/model.json&token=K5iuSsfbU7gyfBX4Ak8E_tnEkK8W0Lb6dk8xxd1wiP0 HTTP/1.1" 200 83
[12/Aug/2021 16:52:05] "OPTIONS /models/1/?token=K5iuSsfbU7gyfBX4Ak8E_tnEkK8W0Lb6dk8xxd1wiP0 HTTP/1.1" 200 0
[12/Aug/2021 16:52:05] "OPTIONS /models/2/?token=K5iuSsfbU7gyfBX4Ak8E_tnEkK8W0Lb6dk8xxd1wiP0 HTTP/1.1" 200 0
[12/Aug/2021 16:52:05] "OPTIONS /models/3/?token=K5iuSsfbU7gyfBX4Ak8E_tnEkK8W0Lb6dk8xxd1wiP0 HTTP/1.1" 200 0
[12/Aug/2021 16:52:05] "GET /models/1/?token=K5iuSsfbU7gyfBX4Ak8E_tnEkK8W0Lb6dk8xxd1wiP0 HTTP/1.1" 200 237
[12/Aug/2021 16:52:05] "OPTIONS /directories?path=C:\Users\faste\Documents\Perceptilabs\Default/Model%203&token=K5iuSsfbU7gyfBX4Ak8E_tnEkK8W0Lb6dk8xxd1wiP0 HTTP/1.1" 200 0
[12/Aug/2021 16:52:05] "GET /models/2/?token=K5iuSsfbU7gyfBX4Ak8E_tnEkK8W0Lb6dk8xxd1wiP0 HTTP/1.1" 200 237
[12/Aug/2021 16:52:05] "GET /models/3/?token=K5iuSsfbU7gyfBX4Ak8E_tnEkK8W0Lb6dk8xxd1wiP0 HTTP/1.1" 200 237
[12/Aug/2021 16:52:05] "HEAD /directories?path=C:\Users\faste\Documents\Perceptilabs\Default/Model%203&token=K5iuSsfbU7gyfBX4Ak8E_tnEkK8W0Lb6dk8xxd1wiP0 HTTP/1.1" 200 71
[12/Aug/2021 16:52:05] "GET /app/updates_available/?token=K5iuSsfbU7gyfBX4Ak8E_tnEkK8W0Lb6dk8xxd1wiP0 HTTP/1.1" 200 22
[12/Aug/2021 16:52:05] "OPTIONS /json_models?path=C:\Users\faste\Documents\Perceptilabs\Default/Model%201/model.json&token=K5iuSsfbU7gyfBX4Ak8E_tnEkK8W0Lb6dk8xxd1wiP0 HTTP/1.1" 200 0
[12/Aug/2021 16:52:05] "OPTIONS /json_models?path=C:\Users\faste\Documents\Perceptilabs\Default/Model%202/model.json&token=K5iuSsfbU7gyfBX4Ak8E_tnEkK8W0Lb6dk8xxd1wiP0 HTTP/1.1" 200 0
[12/Aug/2021 16:52:05] "OPTIONS /json_models?path=C:\Users\faste\Documents\Perceptilabs\Default/Model%203/model.json&token=K5iuSsfbU7gyfBX4Ak8E_tnEkK8W0Lb6dk8xxd1wiP0 HTTP/1.1" 200 0
[12/Aug/2021 16:52:05] "OPTIONS /json_models?path=C:\Users\faste\Documents\Perceptilabs\Default/Model%201/model.json&token=K5iuSsfbU7gyfBX4Ak8E_tnEkK8W0Lb6dk8xxd1wiP0 HTTP/1.1" 200 0
[12/Aug/2021 16:52:05] "OPTIONS /json_models?path=C:\Users\faste\Documents\Perceptilabs\Default/Model%202/model.json&token=K5iuSsfbU7gyfBX4Ak8E_tnEkK8W0Lb6dk8xxd1wiP0 HTTP/1.1" 200 0
[12/Aug/2021 16:52:05] "OPTIONS /json_models?path=C:\Users\faste\Documents\Perceptilabs\Default/Model%203/model.json&token=K5iuSsfbU7gyfBX4Ak8E_tnEkK8W0Lb6dk8xxd1wiP0 HTTP/1.1" 200 0
[12/Aug/2021 16:52:05] "GET /json_models?path=C:\Users\faste\Documents\Perceptilabs\Default/Model%201/model.json&token=K5iuSsfbU7gyfBX4Ak8E_tnEkK8W0Lb6dk8xxd1wiP0 HTTP/1.1" 200 15623
[12/Aug/2021 16:52:05] "GET /json_models?path=C:\Users\faste\Documents\Perceptilabs\Default/Model%202/model.json&token=K5iuSsfbU7gyfBX4Ak8E_tnEkK8W0Lb6dk8xxd1wiP0 HTTP/1.1" 204 34
[12/Aug/2021 16:52:05] "GET /json_models?path=C:\Users\faste\Documents\Perceptilabs\Default/Model%203/model.json&token=K5iuSsfbU7gyfBX4Ak8E_tnEkK8W0Lb6dk8xxd1wiP0 HTTP/1.1" 200 7870
[12/Aug/2021 16:52:05] "GET /json_models?path=C:\Users\faste\Documents\Perceptilabs\Default/Model%201/model.json&token=K5iuSsfbU7gyfBX4Ak8E_tnEkK8W0Lb6dk8xxd1wiP0 HTTP/1.1" 200 15623
[12/Aug/2021 16:52:05] "GET /json_models?path=C:\Users\faste\Documents\Perceptilabs\Default/Model%202/model.json&token=K5iuSsfbU7gyfBX4Ak8E_tnEkK8W0Lb6dk8xxd1wiP0 HTTP/1.1" 204 34
[12/Aug/2021 16:52:06] "GET /json_models?path=C:\Users\faste\Documents\Perceptilabs\Default/Model%203/model.json&token=K5iuSsfbU7gyfBX4Ak8E_tnEkK8W0Lb6dk8xxd1wiP0 HTTP/1.1" 200 7870
[12/Aug/2021 16:52:06] "OPTIONS /json_models?path=C:\Users\faste\Documents\Perceptilabs\Default/Model%201&token=K5iuSsfbU7gyfBX4Ak8E_tnEkK8W0Lb6dk8xxd1wiP0 HTTP/1.1" 200 0
[12/Aug/2021 16:52:06] "POST /json_models?path=C:\Users\faste\Documents\Perceptilabs\Default/Model%201&token=K5iuSsfbU7gyfBX4Ak8E_tnEkK8W0Lb6dk8xxd1wiP0 HTTP/1.1" 200 83
[12/Aug/2021 16:52:06] "OPTIONS /json_models?path=C:\Users\faste\Documents\Perceptilabs\Default/Model%203&token=K5iuSsfbU7gyfBX4Ak8E_tnEkK8W0Lb6dk8xxd1wiP0 HTTP/1.1" 200 0
[12/Aug/2021 16:52:06] "OPTIONS /directories?path=C:\Users\faste\Documents\Perceptilabs\Default/Model%201&token=K5iuSsfbU7gyfBX4Ak8E_tnEkK8W0Lb6dk8xxd1wiP0 HTTP/1.1" 200 0
[12/Aug/2021 16:52:06] "HEAD /directories?path=C:\Users\faste\Documents\Perceptilabs\Default/Model%203&token=K5iuSsfbU7gyfBX4Ak8E_tnEkK8W0Lb6dk8xxd1wiP0 HTTP/1.1" 200 71
[12/Aug/2021 16:52:06] "HEAD /directories?path=C:\Users\faste\Documents\Perceptilabs\Default/Model%201&token=K5iuSsfbU7gyfBX4Ak8E_tnEkK8W0Lb6dk8xxd1wiP0 HTTP/1.1" 200 71
[12/Aug/2021 16:52:06] "POST /json_models?path=C:\Users\faste\Documents\Perceptilabs\Default/Model%203&token=K5iuSsfbU7gyfBX4Ak8E_tnEkK8W0Lb6dk8xxd1wiP0 HTTP/1.1" 200 83
2021-08-12 16:52:07,085 - INFO - perceptilabs\__main__:4 - Started kernel in mode 'rendering'
2021-08-12 16:52:07,085 - INFO - perceptilabs\__main__:4 - Started kernel in mode 'training'
2021-08-12 16:52:07,599 - INFO - perceptilabs\__main__:4 - Reporting errors with commit id: b7e8cd00977f2865e0b2ca4efe5d27fd5d195caf
PerceptiLabs is ready...
2021-08-12 16:52:07,609 - INFO - perceptilabs\__main__:4 - Trying to listen to: 0.0.0.0 5000
2021-08-12 16:52:07,634 - INFO - <frozen importlib._bootstrap>:219 - Initialized sentry for environment 'production' and release '0.12.19'
2021-08-12 16:52:07,646 - INFO - perceptilabs\__main__:4 - Using 'Lightweight' cache for previews...
2021-08-12 16:52:07,650 - INFO - perceptilabs\__main__:4 - Using Threaded executor for training/testing tasks...
2021-08-12 16:52:07,651 - INFO - perceptilabs\__main__:4 - Using 'Dict' cache for pipeline metadata...
2021-08-12 16:52:07,698 - INFO - app.py:1884 - Request to endpoint 'version' took 0.0001s
INFO:perceptilabs.applogger:Request to endpoint 'version' took 0.0001s
2021-08-12 16:52:07,704 - INFO - app.py:1884 - Request to endpoint 'session_proxy' took 0.0001s
INFO:perceptilabs.applogger:Request to endpoint 'session_proxy' took 0.0001s
2021-08-12 16:52:07,707 - INFO - app.py:1884 - Request to endpoint 'session_proxy' took 0.0001s
INFO:perceptilabs.applogger:Request to endpoint 'session_proxy' took 0.0001s
2021-08-12 16:52:07,709 - INFO - app.py:1884 - Request to endpoint 'has_checkpoint' took 0.0001s
INFO:perceptilabs.applogger:Request to endpoint 'has_checkpoint' took 0.0001s
2021-08-12 16:52:07,710 - INFO - app.py:1884 - Request to endpoint 'session_proxy' took 0.0001s
INFO:perceptilabs.applogger:Request to endpoint 'session_proxy' took 0.0001s
2021-08-12 16:52:07,713 - INFO - app.py:1884 - Request to endpoint 'session_proxy' took 0.0001s
INFO:perceptilabs.applogger:Request to endpoint 'session_proxy' took 0.0001s
2021-08-12 16:52:07,718 - INFO - app.py:1884 - Request to endpoint 'session_proxy' took 0.0001s
INFO:perceptilabs.applogger:Request to endpoint 'session_proxy' took 0.0001s
2021-08-12 16:52:07,720 - INFO - app.py:1884 - Request to endpoint 'session_proxy' took 0.0001s
INFO:perceptilabs.applogger:Request to endpoint 'session_proxy' took 0.0001s
2021-08-12 16:52:07,722 - INFO - app.py:1884 - Request to endpoint 'has_checkpoint' took 0.0001s
INFO:perceptilabs.applogger:Request to endpoint 'has_checkpoint' took 0.0001s
2021-08-12 16:52:07,726 - INFO - app.py:1884 - Request to endpoint 'has_checkpoint' took 0.0001s
INFO:perceptilabs.applogger:Request to endpoint 'has_checkpoint' took 0.0001s
2021-08-12 16:52:07,728 - INFO - app.py:1884 - Request to endpoint 'version' took 0.0001s
INFO:perceptilabs.applogger:Request to endpoint 'version' took 0.0001s
Traceback (most recent call last):
  File "C:\Users\faste\anaconda3\envs\labs\lib\site-packages\flask\app.py", line 1513, in full_dispatch_request
rv = self.dispatch_request()
  File "C:\Users\faste\anaconda3\envs\labs\lib\site-packages\flask\app.py", line 1499, in dispatch_request
return self.ensure_sync(self.view_functions[rule.endpoint])(**req.view_args)
  File "C:\Users\faste\anaconda3\envs\labs\lib\site-packages\flask\views.py", line 83, in view
return self.dispatch_request(*args, **kwargs)
  File "perceptilabs\endpoints\session\base.py", line 43, in perceptilabs.endpoints.session.base.SessionProxy.dispatch_request
KeyError: 'receiver'

2021-08-12 16:52:07,735 - ERROR - app.py:1390 - Error in request 'session_proxy'
Traceback (most recent call last):
  File "C:\Users\faste\anaconda3\envs\labs\lib\site-packages\flask\app.py", line 1513, in full_dispatch_request
rv = self.dispatch_request()
  File "C:\Users\faste\anaconda3\envs\labs\lib\site-packages\flask\app.py", line 1499, in dispatch_request
return self.ensure_sync(self.view_functions[rule.endpoint])(**req.view_args)
  File "C:\Users\faste\anaconda3\envs\labs\lib\site-packages\flask\views.py", line 83, in view
return self.dispatch_request(*args, **kwargs)
  File "perceptilabs\endpoints\session\base.py", line 43, in perceptilabs.endpoints.session.base.SessionProxy.dispatch_request
KeyError: 'receiver'
ERROR:perceptilabs.applogger:Error in request 'session_proxy'
Traceback (most recent call last):
  File "C:\Users\faste\anaconda3\envs\labs\lib\site-packages\flask\app.py", line 1513, in full_dispatch_request
rv = self.dispatch_request()
  File "C:\Users\faste\anaconda3\envs\labs\lib\site-packages\flask\app.py", line 1499, in dispatch_request
return self.ensure_sync(self.view_functions[rule.endpoint])(**req.view_args)
  File "C:\Users\faste\anaconda3\envs\labs\lib\site-packages\flask\views.py", line 83, in view
return self.dispatch_request(*args, **kwargs)
  File "perceptilabs\endpoints\session\base.py", line 43, in perceptilabs.endpoints.session.base.SessionProxy.dispatch_request
KeyError: 'receiver'
2021-08-12 16:52:07,743 - INFO - app.py:1884 - Request to endpoint 'session_proxy' took 0.0103s
INFO:perceptilabs.applogger:Request to endpoint 'session_proxy' took 0.0103s
2021-08-12 16:52:07,746 - INFO - app.py:1884 - Request to endpoint 'has_checkpoint' took 0.0004s
INFO:perceptilabs.applogger:Request to endpoint 'has_checkpoint' took 0.0004s
2021-08-12 16:52:07,748 - INFO - app.py:1884 - Request to endpoint 'session_proxy' took 0.0003s
INFO:perceptilabs.applogger:Request to endpoint 'session_proxy' took 0.0003s
2021-08-12 16:52:07,749 - INFO - app.py:1884 - Request to endpoint 'session_proxy' took 0.0002s
INFO:perceptilabs.applogger:Request to endpoint 'session_proxy' took 0.0002s
2021-08-12 16:52:07,754 - INFO - app.py:1884 - Request to endpoint 'session_proxy' took 0.0002s
INFO:perceptilabs.applogger:Request to endpoint 'session_proxy' took 0.0002s
2021-08-12 16:52:07,755 - INFO - app.py:1884 - Request to endpoint 'session_proxy' took 0.0002s
INFO:perceptilabs.applogger:Request to endpoint 'session_proxy' took 0.0002s
2021-08-12 16:52:07,756 - INFO - app.py:1884 - Request to endpoint 'session_proxy' took 0.0002s
INFO:perceptilabs.applogger:Request to endpoint 'session_proxy' took 0.0002s
2021-08-12 16:52:07,759 - INFO - app.py:1884 - Request to endpoint 'has_checkpoint' took 0.0003s
INFO:perceptilabs.applogger:Request to endpoint 'has_checkpoint' took 0.0003s
2021-08-12 16:52:07,761 - INFO - app.py:1884 - Request to endpoint 'has_checkpoint' took 0.0005s
INFO:perceptilabs.applogger:Request to endpoint 'has_checkpoint' took 0.0005s
PerceptiLabs: PerceptiLabs Started

Hi @rylemcc,
Sorry to hear that you ran into an issue!

Just to make sure, pressing ESC does not help either?
Someone from the dev team will jump in here and take a look with you.

All the best,
Robert

1 Like

Hi, @rylemcc,
Can you please send me what’s in browser console?

Press F12 key and go to Console Tab and let us know what you see there.
Thanks,
David.

1 Like
LogRocket: user name passed to identify, but no userID given: identify(userId, { name: '...' }).
e.<computed> @ 0.2e88a9ecc8d131cd15d5.js:349
0.2e88a9ecc8d131cd15d5.js:349 Error: Network Error
    at e.exports (0.2e88a9ecc8d131cd15d5.js:7)
    at XMLHttpRequest.d.onerror (0.2e88a9ecc8d131cd15d5.js:387)
    at XMLHttpRequest.i (0.2e88a9ecc8d131cd15d5.js:387)
e.<computed> @ 0.2e88a9ecc8d131cd15d5.js:349
keycloak.perceptilabs.com:8443/auth/realms/PerceptiLabs:1 Failed to load resource: net::ERR_NAME_NOT_RESOLVED
background1.png:1 Failed to load resource: the server responded with a status of 404 (Not Found)
keycloak.perceptilabs.com:8443/auth/realms/PerceptiLabs:1 Failed to load resource: net::ERR_NAME_NOT_RESOLVED
0.2e88a9ecc8d131cd15d5.js:7 Uncaught (in promise) Error: Network Error
    at e.exports (0.2e88a9ecc8d131cd15d5.js:7)
    at XMLHttpRequest.d.onerror (0.2e88a9ecc8d131cd15d5.js:387)
    at XMLHttpRequest.i (0.2e88a9ecc8d131cd15d5.js:387)
sentry.io/api/1833551/store/?sentry_key=2497f27009b24990b4c0f3feeda4d37d&sentry_version=7:1 Failed to load resource: the server responded with a status of 403 (Forbidden)
0.2e88a9ecc8d131cd15d5.js:349 Userflow.identify: First argument must be a non-empty string representing the user's ID in your database. Value received: undefined
e.<computed> @ 0.2e88a9ecc8d131cd15d5.js:349
:5001/session/proxy:1 Failed to load resource: the server responded with a status of 500 (INTERNAL SERVER ERROR)
20.2e88a9ecc8d131cd15d5.js:349 TypeError: Cannot read property 'Status' of undefined
    at app.ccdde4e3dd9fe818c9ef.js:1
e.<computed> @ 0.2e88a9ecc8d131cd15d5.js:349
:8080/keycloak_url:1 Failed to load resource: net::ERR_CONNECTION_REFUSED
keycloak.perceptilabs.com:8443/auth/realms/PerceptiLabs/account/:1 Failed to load resource: net::ERR_NAME_NOT_RESOLVED
0.2e88a9ecc8d131cd15d5.js:7 Uncaught (in promise) Error: Network Error
    at e.exports (0.2e88a9ecc8d131cd15d5.js:7)
    at XMLHttpRequest.d.onerror (0.2e88a9ecc8d131cd15d5.js:387)
    at XMLHttpRequest.i (0.2e88a9ecc8d131cd15d5.js:387)
:8080/keycloak_url:1 Failed to load resource: net::ERR_CONNECTION_REFUSED
keycloak.perceptilabs.com:8443/auth/realms/PerceptiLabs/account/:1 Failed to load resource: net::ERR_NAME_NOT_RESOLVED
0.2e88a9ecc8d131cd15d5.js:7 Uncaught (in promise) Error: Network Error
    at e.exports (0.2e88a9ecc8d131cd15d5.js:7)
    at XMLHttpRequest.d.onerror (0.2e88a9ecc8d131cd15d5.js:387)
    at XMLHttpRequest.i (0.2e88a9ecc8d131cd15d5.js:387)
sentry.io/api/1833551/store/?sentry_key=2497f27009b24990b4c0f3feeda4d37d&sentry_version=7:1 Failed to load resource: the server responded with a status of 403 (Forbidden)
sentry.io/api/1833551/store/?sentry_key=2497f27009b24990b4c0f3feeda4d37d&sentry_version=7:1 Failed to load resource: the server responded with a status of 403 (Forbidden)

Can you please try log out and log in again?

At the top right it says it’s logged in with modeler@perceptilabs.test . When I press logout it doesn’t change anything on the browser or terminal.

It looks like you have trouble with your network and it’s failing to connect to KeyCloak, so you are logged in to a demo version.
Please check your network and make sure that you can access to http://keycloak.perceptilabs.com:8443/

Now, we’ve added it to our backlog to remove that questionnaire for demo version, and it will be resolved soon.

Thanks for using our tool.
Regards, David.

OK, so that link does not connect and windows diagnostic says my dns might be unavailable.

Attempting to install it on another computer but I am having a different set of issues.

I got it working thanks. I didn’t do anything it just started working now.

This suddenly started happening to me today, too :frowning:
I have connection but there appears to be some certificate problem going on…

trying to reach the link posted earlier gives NET::ERR_CERT_DATE_INVALID

Edit: it appears to have expired this morning…

Hi @birdstream,
Thanks for letting us know!

It looks like the Cert has expired as you said, we will be looking into fixing it asap.
We will push a fix so that the questionnaire doesn’t get stuck when logged in as “modeler@perceptilabs.test” as well.

No problem :slight_smile: The workaround for me now is to F12 in to the console and simply hide the questionnare element. Then i can use perceptilabs like usual (except not logged in)

1 Like

@birdstream thanks for sharing the workaround!
The login is now up and running again :slight_smile:

1 Like